{"text_format":"1","workbook":"xlsx","n_sheets":6,"sheets":["Accueil","Calcul - Aide abattage","Carte admis. - Aide abattage","Versions du fichier","Menus","Log"],"not_rendered":{"charts":0,"images":6,"macros":1,"external_links":0,"defined_names":52,"comments":1,"pivot_tables":0},"unopened":[],"bounds":{"document_bytes":16777216,"sheet_cells":100000,"rows_first":2000,"rows_last":500,"rows_between":2000,"halvings":0,"cell_chars":16384,"cell_head_chars":4096},"cells_cut":0,"cells_raw":0,"read":"whole","date_system":"1900"}

{"sheet":"Accueil","index":0,"n_rows":20,"n_cols":4,"rows_kept":20,"cut":false,"hidden":false,"merged":[[13,3,13,13],[19,3,19,13],[16,3,17,13]]}
[]
[]
[]
[]
[]
[]
[]
[]
[]
[]
[]
[]
[]
[null,null,null,"Programme d’investissement en aménagement forestier (PIAF) - Volet I \nForêt publique\nAnnexe au rapport et au calcul de l'aide à l’abattage des bois feuillus de trituration sans preneur et laissés en forêt\n2022-2023            \n"]
[]
[]
[null,null,null,"L'activation du contenu de ce fichier est requise afin d'assurer l'exécution des macro-commandes qui sont nécessaires\nà son bon fonctionnement."]
[]
[]
[null,null,null,"https://support.office.com/fr-fr/article/activer-ou-d%C3%A9sactiver-les-macros-dans-les-fichiers-office-12b036fd-d140-4e74-b45e-16fed1a7e5c6"]

{"sheet":"Calcul - Aide abattage","index":1,"n_rows":136,"n_cols":101,"rows_kept":136,"cut":false,"hidden":true,"merged":[[60,0,60,5],[60,6,60,8],[2,7,2,8],[9,0,9,4],[52,0,52,8],[22,0,22,5],[35,6,35,8],[36,6,37,8],[54,0,56,5],[54,6,56,8],[57,0,57,5],[57,6,57,8],[18,0,18,5],[18,6,18,8],[12,0,12,8],[32,6,34,8],[61,0,61,8],[41,0,41,8],[42,0,42,8],[43,0,45,5],[43,6,45,8],[46,0,46,5],[46,6,46,8],[47,0,48,5],[47,6,48,8],[49,0,49,5],[49,6,49,8],[50,0,50,8],[51,0,51,8],[58,0,59,5],[58,6,59,8],[53,0,53,8],[20,0,20,8],[0,0,0,8],[39,0,39,8],[40,0,40,8],[13,6,13,8],[14,0,14,8],[5,6,5,8],[6,6,6,8],[7,6,7,8],[8,6,8,8],[3,0,3,5],[3,6,3,8],[7,0,7,5],[17,0,17,5],[10,0,10,5],[38,0,38,5],[38,6,38,8],[27,0,27,8],[28,0,28,8],[36,0,37,5],[35,0,35,5],[32,0,34,5],[29,0,29,8],[30,0,30,8],[31,0,31,8],[1,0,1,8],[4,0,4,8],[26,0,26,5],[13,0,13,5],[24,0,24,5],[25,0,25,5],[15,0,15,8],[16,0,16,8],[17,6,17,8],[19,0,19,5],[23,0,23,8],[21,0,21,5],[2,0,2,6],[5,0,5,5],[6,0,6,5],[8,0,8,5]]}
[]
["Programme d’investissement en aménagement forestier (PIAF) - Volet I \nForêt publique\nAnnexe au rapport et au calcul de l'aide à l’abattage des bois feuillus de trituration sans preneur et laissés en forêt\n2022-2023\n            \n"]
[" *** Veuillez saisir les informations dans les cellules blanches (Planification et BGAD) et jaunes (Ministère) ***",null,null,null,null,null,null,"Version 3  : 2022-10-04"]
["Contexte d'utilisation",null,null,null,null,null,"Inscrire une valeur"]
["Identification"]
["Unité d'aménagement (UA)",null,null,null,null,null,null,null,null,null,null,null,null,null,null,null,null,null,null,null,null,null,null,null,null,null,null,null,null,null,null,null,null,null,null,null,null,null,null,null,null,null,null,null,null,null,null,null,null,null,null,null,null,null,null,null,null,null,null,null,null,null,null,null,null,null,null,null,null,null,null,null,null,null,null,null,null,null,null,null,null,null,null,null,null,null,null,null,null,null,null,null,null,null,null,null,null,null,null,null,"NON"]
["Secteur d'intervention",null,null,null,null,null,null,null,null,null,null,null,null,null,null,null,null,null,null,null,null,null,null,null,null,null,null,null,null,null,null,null,null,null,null,null,null,null,null,null,null,null,null,null,null,null,null,null,null,null,null,null,null,null,null,null,null,null,null,null,null,null,null,null,null,null,null,null,null,null,null,null,null,null,null,null,null,null,null,null,null,null,null,null,null,null,null,null,null,null,null,null,null,null,null,null,null,"01151",151,0]
["Unité de compilation",null,null,null,null,null,null,null,null,null,null,null,null,null,null,null,null,null,null,null,null,null,null,null,null,null,null,null,null,null,null,null,null,null,null,null,null,null,null,null,null,null,null,null,null,null,null,null,null,null,null,null,null,null,null,null,null,null,null,null,null,null,null,null,null,null,null,null,null,null,null,null,null,null,null,null,null,null,null,null,null,null,null,null,null,null,null,null,null,null,null,null,null,null,null,null,null,"01152",152,0]
["Numéro de la prescription",null,null,null,null,null,null,null,null,null,null,null,null,null,null,null,null,null,null,null,null,null,null,null,null,null,null,null,null,null,null,null,null,null,null,null,null,null,null,null,null,null,null,null,null,null,null,null,null,null,null,null,null,null,null,null,null,null,null,null,null,null,null,null,null,null,null,null,null,null,null,null,null,null,null,null,null,null,null,null,null,null,null,null,null,null,null,null,null,null,null,null,null,null,null,null,null,"01251",153,0]
["Zone de tarification\nValeur requise pour déterminer l'admissibilité",null,null,null,null,{"$f":"IFERROR(IF(ISNA(VLOOKUP($I$10,Menus!$A$291:$A$308,1,FALSE)),\"Non_admissible\",\"Question\"),\"Question\")","v":"Non_admissible"}]
["Traitement (Code DICA)",null,null,null,null,null,null,null,"Inscrire une valeur",null,null,null,null,null,null,null,null,null,null,null,null,null,null,null,null,null,null,null,null,null,null,null,null,null,null,null,null,null,null,null,null,null,null,null,null,null,null,null,null,null,null,null,null,null,null,null,null,null,null,null,null,null,null,null,null,null,null,null,null,null,null,null,null,null,null,null,null,null,null,null,null,null,null,null,null,null,null,null,null,null,null,null,null,null,null,null,null,"02661",185,80]
["Traitement (Code RATF)",null,null,null,null,{"$f":"IFERROR(VLOOKUP($I$11,Codes_DICA_RATF_RechercheV,3,FALSE),Menus!$C$288)","v":"RATF_Utilisateur"}]
["Admissibilité",null,null,null,null,null,null,null,null,null,null,null,null,null,null,null,null,null,null,null,null,null,null,null,null,null,null,null,null,null,null,null,null,null,null,null,null,null,null,null,null,null,null,null,null,null,null,null,null,null,null,null,null,null,null,null,null,null,null,null,null,null,null,null,null,null,null,null,null,null,null,null,null,null,null,null,null,null,null,null,null,null,null,null,null,null,null,null,null,null,null,null,null,null,null,null,null,"01253",155,0]
["Le secteur d'intervention est situé dans les régions de l'Outaouais ou des Laurentides\net l'abattage des bois feuillus de trituration et laissés en forêt est autorisé par les représentants régionaux du MFFP ?",null,null,null,null,null,null,null,null,null,null,null,null,null,null,null,null,null,null,null,null,null,null,null,null,null,null,null,null,null,null,null,null,null,null,null,null,null,null,null,null,null,null,null,null,null,null,null,null,null,null,null,null,null,null,null,null,null,null,null,null,null,null,null,null,null,null,null,null,null,null,null,null,null,null,null,null,null,null,null,null,null,null,null,null,null,null,null,null,null,null,null,null,null,null,null,null,"02251",157,0]
["Formule utilisée pour le calcul",null,null,null,null,null,null,null,null,null,null,null,null,null,null,null,null,null,null,null,null,null,null,null,null,null,null,null,null,null,null,null,null,null,null,null,null,null,null,null,null,null,null,null,null,null,null,null,null,null,null,null,null,null,null,null,null,null,null,null,null,null,null,null,null,null,null,null,null,null,null,null,null,null,null,null,null,null,null,null,null,null,null,null,null,null,null,null,null,null,null,null,null,null,null,null,null,"01253",155,0]
["Aide ($/m³) = vpâte * (5,682 / vr 0,3411 + 0,332 * vpâte - 0,586)",null,null,null,null,null,null,null,null,null,null,null,null,null,null,null,null,null,null,null,null,null,null,null,null,null,null,null,null,null,null,null,null,null,null,null,null,null,null,null,null,null,null,null,null,null,null,null,null,null,null,null,null,null,null,null,null,null,null,null,null,null,null,null,null,null,null,null,null,null,null,null,null,null,null,null,null,null,null,null,null,null,null,null,null,null,null,null,null,null,null,null,null,null,null,null,null,"02251",157,0]
["Intrants pour le calcul",null,null,null,null,null,null,null,null,null,null,null,null,null,null,null,null,null,null,null,null,null,null,null,null,null,null,null,null,null,null,null,null,null,null,null,null,null,null,null,null,null,null,null,null,null,null,null,null,null,null,null,null,null,null,null,null,null,null,null,null,null,null,null,null,null,null,null,null,null,null,null,null,null,null,null,null,null,null,null,null,null,null,null,null,null,null,null,null,null,null,null,null,null,null,null,null,"02452",182,0]
["Volume net par hectare des bois feuillus de trituration abattus et laissés en forêt (vpâte)\nLe maximum payable est de 20 m³/ha",null,null,null,null,null,null,null,null,null,null,null,null,null,null,null,null,null,null,null,null,null,null,null,null,null,null,null,null,null,null,null,null,null,null,null,null,null,null,null,null,null,null,null,null,null,null,null,null,null,null,null,null,null,null,null,null,null,null,null,null,null,null,null,null,null,null,null,null,null,null,null,null,null,null,null,null,null,null,null,null,null,null,null,null,null,null,null,null,null,null,null,null,null,null,null,null,"02651",184,200]
["Volume moyen des tiges à récolter, m3/tige brut (vr)"]
["Inscrire les renseignements dans la colonne associée au contexte d'utilisation",null,null,null,null,null,"Planification","BGAD","Ministère"]
["Superficie"]
["Superficie (hectare)",null,null,null,null,null,null,null,null,null,null,null,null,null,null,null,null,null,null,null,null,null,null,null,null,null,null,null,null,null,null,null,null,null,null,null,null,null,null,null,null,null,null,null,null,null,null,null,null,null,null,null,null,null,null,null,null,null,null,null,null,null,null,null,null,null,null,null,null,null,null,null,null,null,null,null,null,null,null,null,null,null,null,null,null,null,null,null,null,null,null,null,null,null,null,null,null,"02451",181,80]
["Tous les critères sont atteints 1 (Oui ou Non)"]
["Résumé de l'aide à l’abattage des bois feuillus de trituration sans preneur et laissés en forêt",null,null,null,null,null,null,null,null,null,null,null,null,null,null,null,null,null,null,null,null,null,null,null,null,null,null,null,null,null,null,null,null,null,null,null,null,null,null,null,null,null,null,null,null,null,null,null,null,null,null,null,null,null,null,null,null,null,null,null,null,null,null,null,null,null,null,null,null,null,null,null,null,null,null,null,null,null,null,null,null,null,null,null,null,null,null,null,null,null,null,null,null,null,null,null,null,"06452",257,280]
[{"$f":"IFERROR(IF($G$18<=Menus!$B$322,\"Aide finale ($/m³)\",IF('Calcul - Aide abattage'!$G$18>Menus!$B$322,\"Aide finale ($/m³) - le maximum payable de \"&Menus!$B$322&\" m³/ha est atteint\",\"Aide finale ($/m³)\")),\"Aide finale ($/m³)\")","v":"Aide finale ($/m³)"},null,null,null,null,null,{"$f":"IFERROR(IF(EXACT(UPPER($G$14),UPPER(Menus!$A$2)),IF($G$18<=Menus!$B$322,$G$18*(Menus!$B$318/POWER($G$19,Menus!$B$319)+Menus!$B$320*$G$18-Menus!$B$321)/$G$18,Menus!$B$322*(Menus!$B$318/POWER($G$19,Menus!$B$319)+Menus!$B$320*Menus!$B$322-Menus!$B$321)/$G$18),0),0)","v":0},{"$f":"IFERROR(IF(EXACT(UPPER($G$14),UPPER(Menus!$A$2)),IF(ISBLANK($H$23)=FALSE,IF(OR(EXACT(UPPER($G$4),UPPER(Menus!$A$313)),EXACT(UPPER($G$4),UPPER(Menus!$A$314))),IF($G$18<=Menus!$B$322,$G$18*(Menus!$B$318/POWER($G$19,Menus!$B$319)+Menus!$B$320*$G$18-Menus!$B$321)/$G$18,Menus!$B$322*(Menus!$B$318/POWER($G$19,Menus!$B$319)+Menus!$B$320*Menus!$B$322-Menus!$B$321)/$G$18),0),0),0),0)","v":0},{"$f":"IFERROR(IF(EXACT(UPPER($G$14),UPPER(Menus!$A$2)),IF(EXACT(UPPER($G$4),UPPER(Menus!$A$314)),IF($G$18<=Menus!$B$322,$G$18*(Menus!$B$318/POWER($G$19,Menus!$B$319)+Menus!$B$320*$G$18-Menus!$B$321)/$G$18*$I$23,Menus!$B$322*(Menus!$B$318/POWER($G$19,Menus!$B$319)+Menus!$B$320*Menus!$B$322-Menus!$B$321)/$G$18*$I$23),0),0),0)","v":0},null,null,null,null,null,null,null,null,null,null,null,null,null,null,null,null,null,null,null,null,null,null,null,null,null,null,null,null,null,null,null,null,null,null,null,null,null,null,null,null,null,null,null,null,null,null,null,null,null,null,null,null,null,null,null,null,null,null,null,null,null,null,null,null,null,null,null,null,null,null,null,null,null,null,null,null,null,null,null,null,null,null,null,null,null,null,null,null,"07151",258,280]
["Aide finale ($/ha) - taux à inscrire à l'état d'avancement et au RATF",null,null,null,null,null,{"$f":"IFERROR(ROUND($G$25*$G$18,2),0)","v":0},{"$f":"IFERROR(ROUND($H$25*$G$18,2),0)","v":0},{"$f":"IFERROR(ROUND($I$25*$G$18,2),0)","v":0},null,null,null,null,null,null,null,null,null,null,null,null,null,null,null,null,null,null,null,null,null,null,null,null,null,null,null,null,null,null,null,null,null,null,null,null,null,null,null,null,null,null,null,null,null,null,null,null,null,null,null,null,null,null,null,null,null,null,null,null,null,null,null,null,null,null,null,null,null,null,null,null,null,null,null,null,null,null,null,null,null,null,null,null,null,null,null,null,"07152",259,280]
["Aide finale ($)",null,null,null,null,null,{"$f":"IFERROR(ROUND($G$26*$G$22,2),0)","v":0},{"$f":"IFERROR(ROUND($H$26*$H$22,2),0)","v":0},{"$f":"IFERROR(ROUND($I$26*$I$22,2),0)","v":0},null,null,null,null,null,null,null,null,null,null,null,null,null,null,null,null,null,null,null,null,null,null,null,null,null,null,null,null,null,null,null,null,null,null,null,null,null,null,null,null,null,null,null,null,null,null,null,null,null,null,null,null,null,null,null,null,null,null,null,null,null,null,null,null,null,null,null,null,null,null,null,null,null,null,null,null,null,null,null,null,null,null,null,null,null,null,null,null,"07251",260,280]
[null,null,null,null,null,null,null,null,null,null,null,null,null,null,null,null,null,null,null,null,null,null,null,null,null,null,null,null,null,null,null,null,null,null,null,null,null,null,null,null,null,null,null,null,null,null,null,null,null,null,null,null,null,null,null,null,null,null,null,null,null,null,null,null,null,null,null,null,null,null,null,null,null,null,null,null,null,null,null,null,null,null,null,null,null,null,null,null,null,null,null,null,null,null,null,null,null,"07351",261,280]
["Section réservée à l'usage de la Planification"]
["Remarques",null,null,null,null,null,null,null,null,null,null,null,null,null,null,null,null,null,null,null,null,null,null,null,null,null,null,null,null,null,null,null,null,null,null,null,null,null,null,null,null,null,null,null,null,null,null,null,null,null,null,null,null,null,null,null,null,null,null,null,null,null,null,null,null,null,null,null,null,null,null,null,null,null,null,null,null,null,null,null,null,null,null,null,null,null,null,null,null,null,null,null,null,null,null,null,null,"07451",263,280]
[null,null,null,null,null,null,null,null,null,null,null,null,null,null,null,null,null,null,null,null,null,null,null,null,null,null,null,null,null,null,null,null,null,null,null,null,null,null,null,null,null,null,null,null,null,null,null,null,null,null,null,null,null,null,null,null,null,null,null,null,null,null,null,null,null,null,null,null,null,null,null,null,null,null,null,null,null,null,null,null,null,null,null,null,null,null,null,null,null,null,null,null,null,null,null,null,null,"08251",266,200]
["J'atteste que les renseignements fournis dans ce document afin de calculer l'aide supplémentaire sont complets et conformes à la vérité, au meilleur de mes connaissances.",null,null,null,null,null,null,null,null,null,null,null,null,null,null,null,null,null,null,null,null,null,null,null,null,null,null,null,null,null,null,null,null,null,null,null,null,null,null,null,null,null,null,null,null,null,null,null,null,null,null,null,null,null,null,null,null,null,null,null,null,null,null,null,null,null,null,null,null,null,null,null,null,null,null,null,null,null,null,null,null,null,null,null,null,null,null,null,null,null,null,null,null,null,null,null,null,"08665",276,280]
[null,null,null,null,null,null,null,null,null,null,null,null,null,null,null,null,null,null,null,null,null,null,null,null,null,null,null,null,null,null,null,null,null,null,null,null,null,null,null,null,null,null,null,null,null,null,null,null,null,null,null,null,null,null,null,null,null,null,null,null,null,null,null,null,null,null,null,null,null,null,null,null,null,null,null,null,null,null,null,null,null,null,null,null,null,null,null,null,null,null,null,null,null,null,null,null,null,"08666",277,280]
[null,null,null,null,null,null,null,null,null,null,null,null,null,null,null,null,null,null,null,null,null,null,null,null,null,null,null,null,null,null,null,null,null,null,null,null,null,null,null,null,null,null,null,null,null,null,null,null,null,null,null,null,null,null,null,null,null,null,null,null,null,null,null,null,null,null,null,null,null,null,null,null,null,null,null,null,null,null,null,null,null,null,null,null,null,null,null,null,null,null,null,null,null,null,null,null,null,"08751",278,280]
[null,null,null,null,null,null,null,null,null,null,null,null,null,null,null,null,null,null,null,null,null,null,null,null,null,null,null,null,null,null,null,null,null,null,null,null,null,null,null,null,null,null,null,null,null,null,null,null,null,null,null,null,null,null,null,null,null,null,null,null,null,null,null,null,null,null,null,null,null,null,null,null,null,null,null,null,null,null,null,null,null,null,null,null,null,null,null,null,null,null,null,null,null,null,null,null,null,"08762",279,280]
["Nom et prénom de l'ingénieur forestier",null,null,null,null,null,"No de permis",null,null,null,null,null,null,null,null,null,null,null,null,null,null,null,null,null,null,null,null,null,null,null,null,null,null,null,null,null,null,null,null,null,null,null,null,null,null,null,null,null,null,null,null,null,null,null,null,null,null,null,null,null,null,null,null,null,null,null,null,null,null,null,null,null,null,null,null,null,null,null,null,null,null,null,null,null,null,null,null,null,null,null,null,null,null,null,null,null,null,"08763",280,280]
[null,null,null,null,null,null,{"$f":"TODAY()","v":"2022-10-04"},null,null,null,null,null,null,null,null,null,null,null,null,null,null,null,null,null,null,null,null,null,null,null,null,null,null,null,null,null,null,null,null,null,null,null,null,null,null,null,null,null,null,null,null,null,null,null,null,null,null,null,null,null,null,null,null,null,null,null,null,null,null,null,null,null,null,null,null,null,null,null,null,null,null,null,null,null,null,null,null,null,null,null,null,null,null,null,null,null,null,"08764",281,280]
[null,null,null,null,null,null,null,null,null,null,null,null,null,null,null,null,null,null,null,null,null,null,null,null,null,null,null,null,null,null,null,null,null,null,null,null,null,null,null,null,null,null,null,null,null,null,null,null,null,null,null,null,null,null,null,null,null,null,null,null,null,null,null,null,null,null,null,null,null,null,null,null,null,null,null,null,null,null,null,null,null,null,null,null,null,null,null,null,null,null,null,null,null,null,null,null,null,"09351",282,280]
["Signature de l'ingénieur forestier",null,null,null,null,null,"Date (AAAA-MM-JJ)",null,null,null,null,null,null,null,null,null,null,null,null,null,null,null,null,null,null,null,null,null,null,null,null,null,null,null,null,null,null,null,null,null,null,null,null,null,null,null,null,null,null,null,null,null,null,null,null,null,null,null,null,null,null,null,null,null,null,null,null,null,null,null,null,null,null,null,null,null,null,null,null,null,null,null,null,null,null,null,null,null,null,null,null,null,null,null,null,null,null,"09352",283,280]
["Section réservée à l'usage du BGAD",null,null,null,null,null,null,null,null,null,null,null,null,null,null,null,null,null,null,null,null,null,null,null,null,null,null,null,null,null,null,null,null,null,null,null,null,null,null,null,null,null,null,null,null,null,null,null,null,null,null,null,null,null,null,null,null,null,null,null,null,null,null,null,null,null,null,null,null,null,null,null,null,null,null,null,null,null,null,null,null,null,null,null,null,null,null,null,null,null,null,null,null,null,null,null,null,null,455,0]
{"$rows_left_out":97}
{"sheet":"Carte admis. - Aide abattage","index":2,"n_rows":0,"n_cols":0,"rows_kept":0,"cut":false,"hidden":true,"merged":[]}

{"sheet":"Versions du fichier","index":3,"n_rows":13,"n_cols":33,"rows_kept":13,"cut":false,"hidden":true,"merged":[[0,0,0,16],[0,19,0,24]]}
["Programme d’investissement en aménagement forestier (PIAF) - Volet I \nForêt publique\nSuivi des versions du fichier de l'annexe au rapport et au calcul de l'aide à l’abattage des bois feuillus de trituration sans preneur\net laissés en forêt pour l'exercice 2022-2023",null,null,null,null,null,null,null,null,null,null,null,null,null,null,null,null,null,null,"Version 3  : 2022-10-04",null,null,null,null,null,null,null,null,null,null,null,null,{"$f":"TODAY()","v":"2022-10-04"}]
[]
["Version 1","Nom du fichier :","Calcul_aide_PIAF_Volet_I_Aide_abattage_2022-2023_2022-05-04.xlsm"]
[{"$f":"A3","v":"Version 1"},"Date de mise en ligne :","2022-05-04 ou dans les jours suivants."]
[{"$f":"A4","v":"Version 1"},"Remarques :","• Version initiale proposée pour la période de consultation"]
[{"$f":"A5","v":"Version 1"}]
["Version 2","Nom du fichier :","Calcul_aide_PIAF_Volet_I_Aide_abattage_2022-2023_2022-07-05.xlsm"]
["Version 1","Date de mise en ligne :","2022-07-05 ou dans les jours suivants."]
["Version 1","Remarques :","• Version finale pour la saison 2022-2023"]
[{"$f":"A9","v":"Version 1"}]
["Version 3","Nom du fichier :","Calcul_aide_PIAF_Volet_I_Aide_abattage_2022-2023_2022-07-05.xlsm"]
["Version 1","Date de mise en ligne :","2022-10-04 ou dans les jours suivants."]
["Version 1","Remarques :","• Version pour publication avec ajustement final"]

{"sheet":"Menus","index":4,"n_rows":326,"n_cols":4,"rows_kept":326,"cut":false,"hidden":true,"merged":[]}
["Question"]
["Oui"]
["Non"]
["Non admisible"]
[]
["UA AABFTSPLF"]
["06151"]
["06452"]
["06471"]
["07151"]
["07152"]
["07251"]
["07351"]
["07352"]
["07451"]
[]
["Codes_Dica : OK 2022-04-06 n36"]
["CJB-EMR"]
["CJP"]
["CJP-AM"]
["CJPG"]
["CJPG-AM"]
["CJT-EMR"]
["CPI_CP-ENS_B"]
["CPI_CP-ENS_U"]
["CPI_CP-SEC_B"]
["CPI_CP-SEC_U"]
["CPI_RL-1INR_ENS"]
["CPI_RL-1INR_MUL"]
["CPI_RL-1INR_SEC"]
["CPI_RL-2I_ENS"]
["CPI_RL-2I_MUL"]
["CPI_RL-2I_SEC"]
["CPI_RL-3I_ENS"]
["CPI_RL-3I_MUL"]
["CPI_RL-3I_SEC"]
["CPI_RL-MUL"]
["CPI_RL-PR"]
["CPR_BA"]
["CPR_T"]
{"$rows_left_out":287}
{"sheet":"Log","index":5,"n_rows":5,"n_cols":4,"rows_kept":5,"cut":false,"hidden":true,"merged":[]}
["Utilisateur","Date","OS","Excel"]
["Pouliot, Simon (BMMB)","2022-04-07T07:34:38","Windows (32-bit) NT 6.01","15.0"]
["St-Pierre, Stéphane (BMMB)","2022-07-05T09:27:08","Windows (64-bit) NT 10.00","16.0"]
["St-Pierre, Stéphane (BMMB)","2022-07-06T08:05:25","Windows (64-bit) NT 10.00","16.0"]
["St-Pierre, Stéphane (BMMB)","2022-10-04T13:06:25","Windows (64-bit) NT 10.00","16.0"]