{"text_format":"1","workbook":"xlsx","n_sheets":6,"sheets":["Accueil","Calcul de l'aide - Caribou","Carte - Admissibilité - Caribou","Versions du fichier","Menus","Log"],"not_rendered":{"charts":0,"images":6,"macros":1,"external_links":0,"defined_names":51,"comments":1,"pivot_tables":0},"unopened":[],"bounds":{"document_bytes":16777216,"sheet_cells":100000,"rows_first":2000,"rows_last":500,"rows_between":2000,"halvings":0,"cell_chars":16384,"cell_head_chars":4096},"cells_cut":0,"cells_raw":0,"read":"whole","date_system":"1900"}

{"sheet":"Accueil","index":0,"n_rows":22,"n_cols":4,"rows_kept":22,"cut":false,"hidden":false,"merged":[[14,3,14,13],[21,3,21,13],[17,3,18,13]]}
[]
[]
[]
[]
[]
[]
[]
[]
[]
[]
[]
[]
[]
[]
[null,null,null,"Programme d’investissement en aménagement forestier (PIAF) - Volet II\nForêt publique\nAnnexe au rapport et au calcul de l'aide pour la récolte des bois découlant de l’application des modalités\nd’aménagement de l’habitat du caribou forestier et montagnard 2021-2022\n"]
[]
[]
[null,null,null,"L'activation du contenu de ce fichier est requise afin d'assurer l'exécution des macro-commandes qui sont\nnécessaires à son bon fonctionnement."]
[]
[]
[]
[null,null,null,"https://support.office.com/fr-fr/article/activer-ou-d%C3%A9sactiver-les-macros-dans-les-fichiers-office-12b036fd-d140-4e74-b45e-16fed1a7e5c6"]

{"sheet":"Calcul de l'aide - Caribou","index":1,"n_rows":133,"n_cols":101,"rows_kept":133,"cut":false,"hidden":true,"merged":[[9,0,9,4],[13,0,13,8],[10,6,10,8],[11,6,11,8],[11,0,11,4],[20,0,20,5],[19,0,19,5],[10,0,10,5],[12,0,12,5],[14,0,14,5],[15,0,15,5],[16,0,16,5],[18,0,18,5],[5,6,5,8],[6,6,6,8],[7,6,7,8],[8,6,8,8],[32,0,32,8],[29,0,29,5],[30,0,30,5],[31,0,31,5],[8,0,8,5],[27,0,27,5],[28,0,28,8],[5,0,5,5],[6,0,6,5],[17,0,17,8],[7,0,7,5],[22,0,22,5],[0,0,0,8],[1,0,1,8],[2,7,2,8],[2,0,2,6],[4,0,4,8],[3,0,3,5],[3,6,3,8],[54,0,54,5],[54,6,54,8],[63,0,64,5],[63,6,64,8],[65,0,65,5],[65,6,65,8],[55,0,55,8],[56,0,56,8],[57,0,57,8],[58,0,58,8],[59,0,61,5],[59,6,61,8],[62,0,62,5],[62,6,62,8],[48,0,50,5],[48,6,50,8],[51,0,51,5],[51,6,51,8],[52,0,53,5],[52,6,53,8],[47,0,47,8],[40,0,40,5],[40,6,40,8],[41,0,42,5],[41,6,42,8],[43,0,43,5],[43,6,43,8],[26,0,26,8],[21,0,21,5],[44,0,44,8],[45,0,45,8],[46,0,46,8],[33,0,33,8],[34,0,34,8],[35,0,35,8],[36,0,36,8],[37,0,39,5],[37,6,39,8],[24,0,24,5],[25,0,25,5],[23,0,23,8]]}
[]
["Programme d’investissement en aménagement forestier (PIAF) - Volet II\nForêt publique\nAnnexe au rapport et au calcul de l'aide pour la récolte des bois découlant de l’application des modalités\nd’aménagement de l’habitat du caribou forestier et montagnard\n2021-2022\n"]
[" *** Veuillez saisir les informations dans les cellules blanches (Planification et BGAD) et jaunes (Ministère) ***",null,null,null,null,null,null,"Version 2 : 2021-06-09"]
["Contexte d'utilisation",null,null,null,null,null,"Inscrire une valeur",null,null,null,null,null,null,null,null,null,null,null,null,null,null,null,null,null,null,null,null,null,null,null,null,null,null,null,null,null,null,null,null,null,null,null,null,null,null,null,null,null,null,null,null,null,null,null,null,null,null,null,null,null,null,null,null,null,null,null,null,null,null,null,null,null,null,null,null,null,null,null,null,null,null,null,null,null,null,null,null,null,null,null,null,null,null,null,null,null,null,null,null,"UAF","Zone"]
["Identification"]
["Unité d'aménagement (UA)",null,null,null,null,null,null,null,null,null,null,null,null,null,null,null,null,null,null,null,null,null,null,null,null,null,null,null,null,null,null,null,null,null,null,null,null,null,null,null,null,null,null,null,null,null,null,null,null,null,null,null,null,null,null,null,null,null,null,null,null,null,null,null,null,null,null,null,null,null,null,null,null,null,null,null,null,null,null,null,null,null,null,null,null,null,null,null,null,null,null,null,null,null,null,null,null,null,null,null,"NON"]
["Secteur d'intervention",null,null,null,null,null,null,null,null,null,null,null,null,null,null,null,null,null,null,null,null,null,null,null,null,null,null,null,null,null,null,null,null,null,null,null,null,null,null,null,null,null,null,null,null,null,null,null,null,null,null,null,null,null,null,null,null,null,null,null,null,null,null,null,null,null,null,null,null,null,null,null,null,null,null,null,null,null,null,null,null,null,null,null,null,null,null,null,null,null,null,null,null,null,null,null,null,"01151",151,0]
["Unité de compilation",null,null,null,null,null,null,null,null,null,null,null,null,null,null,null,null,null,null,null,null,null,null,null,null,null,null,null,null,null,null,null,null,null,null,null,null,null,null,null,null,null,null,null,null,null,null,null,null,null,null,null,null,null,null,null,null,null,null,null,null,null,null,null,null,null,null,null,null,null,null,null,null,null,null,null,null,null,null,null,null,null,null,null,null,null,null,null,null,null,null,null,null,null,null,null,null,"01152",152,0]
["Numéro de la prescription",null,null,null,null,null,null,null,null,null,null,null,null,null,null,null,null,null,null,null,null,null,null,null,null,null,null,null,null,null,null,null,null,null,null,null,null,null,null,null,null,null,null,null,null,null,null,null,null,null,null,null,null,null,null,null,null,null,null,null,null,null,null,null,null,null,null,null,null,null,null,null,null,null,null,null,null,null,null,null,null,null,null,null,null,null,null,null,null,null,null,null,null,null,null,null,null,"01251",153,0]
["Zone de tarification\nValeur requise pour déterminer l'admissibilité et établir le montant de l'aide",null,null,null,null,{"$f":"IFERROR(IF(ISNUMBER(VLOOKUP($I$10,Tableau_ZT_Facteur,2,FALSE)),\"Question\",\"Non_admissible\"),\"Question\")","v":"Non_admissible"},null,null,"Inscrire une valeur",null,null,null,null,null,null,null,null,null,null,null,null,null,null,null,null,null,null,null,null,null,null,null,null,null,null,null,null,null,null,null,null,null,null,null,null,null,null,null,null,null,null,null,null,null,null,null,null,null,null,null,null,null,null,null,null,null,null,null,null,null,null,null,null,null,null,null,null,null,null,null,null,null,null,null,null,null,null,null,null,null,null,null,null,null,null,null,null,"02661",185,80]
["Traitement (Code DICA)",null,null,null,null,null,"Inscrire une valeur"]
["Traitement (Code RATF)",null,null,null,null,{"$f":"IFERROR(VLOOKUP($G$11,Codes_DICA_INDIRECT,3,FALSE),\"RATF_Inscrire_une_valeur\")","v":"RATF_Inscrire_une_valeur"}]
["Inscrire les renseignements dans la colonne associée au contexte d'utilisation",null,null,null,null,null,"Planification","BGAD","Ministère"]
["Admissibilité",null,null,null,null,null,null,null,null,null,null,null,null,null,null,null,null,null,null,null,null,null,null,null,null,null,null,null,null,null,null,null,null,null,null,null,null,null,null,null,null,null,null,null,null,null,null,null,null,null,null,null,null,null,null,null,null,null,null,null,null,null,null,null,null,null,null,null,null,null,null,null,null,null,null,null,null,null,null,null,null,null,null,null,null,null,null,null,null,null,null,null,null,null,null,null,null,"01253",155,0]
["Peuplement résineux ou mixte ET surface terrière SEPM > 25% ?",null,null,null,null,null,null,null,null,null,null,null,null,null,null,null,null,null,null,null,null,null,null,null,null,null,null,null,null,null,null,null,null,null,null,null,null,null,null,null,null,null,null,null,null,null,null,null,null,null,null,null,null,null,null,null,null,null,null,null,null,null,null,null,null,null,null,null,null,null,null,null,null,null,null,null,null,null,null,null,null,null,null,null,null,null,null,null,null,null,null,null,null,null,null,null,null,"02251",157,0]
["Secteur d'intervention bénéficiant d'une autre aide du Programme d'investissement en aménagement forestier (PIAF) ?\nLe cas échéant, inscrire le montant à l'hectare ($/ha) à la ligne suivante"]
["Montant de l'aide déjà accordée ($/ha) en vertu du PIAF"]
["Intrants pour le calcul",null,null,null,null,null,null,null,null,null,null,null,null,null,null,null,null,null,null,null,null,null,null,null,null,null,null,null,null,null,null,null,null,null,null,null,null,null,null,null,null,null,null,null,null,null,null,null,null,null,null,null,null,null,null,null,null,null,null,null,null,null,null,null,null,null,null,null,null,null,null,null,null,null,null,null,null,null,null,null,null,null,null,null,null,null,null,null,null,null,null,null,null,null,null,null,null,"02452",182,0]
["Volume net pour le sciage SEPM (m3/ha)",null,null,null,null,null,null,null,null,null,null,null,null,null,null,null,null,null,null,null,null,null,null,null,null,null,null,null,null,null,null,null,null,null,null,null,null,null,null,null,null,null,null,null,null,null,null,null,null,null,null,null,null,null,null,null,null,null,null,null,null,null,null,null,null,null,null,null,null,null,null,null,null,null,null,null,null,null,null,null,null,null,null,null,null,null,null,null,null,null,null,null,null,null,null,null,null,"02651",184,200]
["Volume net pour la pâte SEPM (m3/ha)",null,null,null,null,null,null,null,null,null,null,null,null,null,null,null,null,null,null,null,null,null,null,null,null,null,null,null,null,null,null,null,null,null,null,null,null,null,null,null,null,null,null,null,null,null,null,null,null,null,null,null,null,null,null,null,null,null,null,null,null,null,null,null,null,null,null,null,null,null,null,null,null,null,null,null,null,null,null,null,null,null,null,null,null,null,null,null,null,null,null,null,null,null,null,null,null,"02651",184,200]
["Volume net pour les feuillus durs (m3/ha)\nInclure les résineux autres que SEPM",null,null,null,null,null,null,null,null,null,null,null,null,null,null,null,null,null,null,null,null,null,null,null,null,null,null,null,null,null,null,null,null,null,null,null,null,null,null,null,null,null,null,null,null,null,null,null,null,null,null,null,null,null,null,null,null,null,null,null,null,null,null,null,null,null,null,null,null,null,null,null,null,null,null,null,null,null,null,null,null,null,null,null,null,null,null,null,null,null,null,null,null,null,null,null,null,"02651",184,200]
["Volume net pour les peupliers (m3/ha)"]
["Volume net toutes essences (m3/ha)",null,null,null,null,null,{"$f":"IFERROR(SUM($G$19:$G$22),0)","v":0},{"$f":"IFERROR(IF(OR(EXACT(UPPER($G$4),UPPER(Menus!$A$195)),EXACT(UPPER($G$4),UPPER(Menus!$A$196))),SUM($H$19:$H$22),0),0)","v":0},{"$f":"IFERROR(IF(EXACT(UPPER($G$4),UPPER(Menus!$A$196)),SUM($I$19:$I$22),0),0)","v":0},null,null,null,null,null,null,null,null,null,null,null,null,null,null,null,null,null,null,null,null,null,null,null,null,null,null,null,null,null,null,null,null,null,null,null,null,null,null,null,null,null,null,null,null,null,null,null,null,null,null,null,null,null,null,null,null,null,null,null,null,null,null,null,null,null,null,null,null,null,null,null,null,null,null,null,null,null,null,null,null,null,null,null,null,null,null,null,null,"02651",184,200]
["Récolte",null,null,null,null,null,null,null,null,null,null,null,null,null,null,null,null,null,null,null,null,null,null,null,null,null,null,null,null,null,null,null,null,null,null,null,null,null,null,null,null,null,null,null,null,null,null,null,null,null,null,null,null,null,null,null,null,null,null,null,null,null,null,null,null,null,null,null,null,null,null,null,null,null,null,null,null,null,null,null,null,null,null,null,null,null,null,null,null,null,null,null,null,null,null,null,null,"01253",155,0]
["Est-ce que tout le volume des feuillus durs est récolté ?",null,null,null,null,null,null,null,null,null,null,null,null,null,null,null,null,null,null,null,null,null,null,null,null,null,null,null,null,null,null,null,null,null,null,null,null,null,null,null,null,null,null,null,null,null,null,null,null,null,null,null,null,null,null,null,null,null,null,null,null,null,null,null,null,null,null,null,null,null,null,null,null,null,null,null,null,null,null,null,null,null,null,null,null,null,null,null,null,null,null,null,null,null,null,null,null,"02351",158,0]
["Est-ce que tout le volume des peupliers est récolté ?",null,null,null,null,null,null,null,null,null,null,null,null,null,null,null,null,null,null,null,null,null,null,null,null,null,null,null,null,null,null,null,null,null,null,null,null,null,null,null,null,null,null,null,null,null,null,null,null,null,null,null,null,null,null,null,null,null,null,null,null,null,null,null,null,null,null,null,null,null,null,null,null,null,null,null,null,null,null,null,null,null,null,null,null,null,null,null,null,null,null,null,null,null,null,null,null,"02351",158,0]
["Superficie",null,null,null,null,null,null,null,null,null,null,null,null,null,null,null,null,null,null,null,null,null,null,null,null,null,null,null,null,null,null,null,null,null,null,null,null,null,null,null,null,null,null,null,null,null,null,null,null,null,null,null,null,null,null,null,null,null,null,null,null,null,null,null,null,null,null,null,null,null,null,null,null,null,null,null,null,null,null,null,null,null,null,null,null,null,null,null,null,null,null,null,null,null,null,null,null,"02452",182,0]
["Superficie (hectare)",null,null,null,null,null,null,null,null,null,null,null,null,null,null,null,null,null,null,null,null,null,null,null,null,null,null,null,null,null,null,null,null,null,null,null,null,null,null,null,null,null,null,null,null,null,null,null,null,null,null,null,null,null,null,null,null,null,null,null,null,null,null,null,null,null,null,null,null,null,null,null,null,null,null,null,null,null,null,null,null,null,null,null,null,null,null,null,null,null,null,null,null,null,null,null,null,"02451",181,80]
["Résumé de l'aide pour la récolte des bois découlant de l’application des modalités d’aménagement de l’habitat du caribou forestier et montagnard",null,null,null,null,null,null,null,null,null,null,null,null,null,null,null,null,null,null,null,null,null,null,null,null,null,null,null,null,null,null,null,null,null,null,null,null,null,null,null,null,null,null,null,null,null,null,null,null,null,null,null,null,null,null,null,null,null,null,null,null,null,null,null,null,null,null,null,null,null,null,null,null,null,null,null,null,null,null,null,null,null,null,null,null,null,null,null,null,null,null,null,null,null,null,null,null,"06452",257,280]
["Aide brute ($/ha) - incluant le montant PIAF déjà accordé, le cas échant ",null,null,null,null,null,{"$f":"IFERROR(IF(EXACT(UPPER($G$15),UPPER(Menus!$A$2))=FALSE,0,IF(AND(EXACT(UPPER($G$16),UPPER(Menus!$A$2)),ISNUMBER($G$17)=FALSE),\"Valider G17\",IF(AND(EXACT(UPPER($G$25),UPPER(Menus!$A$2)),EXACT(UPPER($G$26),UPPER(Menus!$A$2))),Menus!$B$159*VLOOKUP($I$10,Tableau_ZT_Facteur,2,FALSE)*Facteur_Aide,IF(AND(OR(EXACT(UPPER($G$25),UPPER(Menus!$A$3)),EXACT(UPPER($G$25),UPPER(Sans_objet))),EXACT(UPPER($G$26),UPPER(Menus!$A$2))),Menus!$B$160*VLOOKUP($I$10,Tableau_ZT_Facteur,2,FALSE)*Facteur_Aide,IF(AND(EXACT(UPPER($G$25),UPPER(Menus!$A$2)),OR(EXACT(UPPER($G$26),UPPER(Menus!$A$3)),EXACT(UPPER($G$26),UPPER(Sans_objet)))),Menus!$B$161*VLOOKUP($I$10,Tableau_ZT_Facteur,2,FALSE)*Facteur_Aide,IF(AND(OR(EXACT(UPPER($G$25),UPPER(Menus!$A$3)),EXACT(UPPER($G$25),UPPER(Sans_objet))),OR(EXACT(UPPER($G$26),UPPER(Menus!$A$3)),EXACT(UPPER($G$26),UPPER(Sans_objet)))),Menus!$B$162*VLOOKUP($I$10,Tableau_ZT_Facteur,2,FALSE)*Facteur_Aide,0)))))),0)","v":0},{"$f":"IFERROR(IF(EXACT(UPPER($H$15),UPPER(Menus!$A$2))=FALSE,0,IF(OR(EXACT(UPPER($G$4),UPPER(Menus!$A$195)),EXACT(UPPER($G$4),UPPER(Menus!$A$196))),IF(AND(EXACT(UPPER($H$16),UPPER(Menus!$A$2)),ISNUMBER($H$17)=FALSE),\"Valider H17\",IF(AND(EXACT(UPPER($H$25),UPPER(Menus!$A$2)),EXACT(UPPER($H$26),UPPER(Menus!$A$2))),Menus!$C$159*VLOOKUP($I$10,Tableau_ZT_Facteur,2,FALSE)*Facteur_Aide,IF(AND(OR(EXACT(UPPER($H$25),UPPER(Menus!$A$3)),EXACT(UPPER($H$25),UPPER(Sans_objet))),EXACT(UPPER($H$26),UPPER(Menus!$A$2))),Menus!$C$160*VLOOKUP($I$10,Tableau_ZT_Facteur,2,FALSE)*Facteur_Aide,IF(AND(EXACT(UPPER($H$25),UPPER(Menus!$A$2)),OR(EXACT(UPPER($H$26),UPPER(Menus!$A$3)),EXACT(UPPER($H$26),UPPER(Sans_objet)))),Menus!$C$161*VLOOKUP($I$10,Tableau_ZT_Facteur,2,FALSE)*Facteur_Aide,IF(AND(OR(EXACT(UPPER($H$25),UPPER(Menus!$A$3)),EXACT(UPPER($H$25),UPPER(Sans_objet))),OR(EXACT(UPPER($H$26),UPPER(Menus!$A$3)),EXACT(UPPER($H$26),UPPER(Sans_objet)))),Menus!$C$162*VLOOKUP($I$10,Tableau_ZT_Facteur,2,FALSE)*Facteur_Aide,0))))),0)),0)","v":0},{"$f":"IFERROR(IF(EXACT(UPPER($I$15),UPPER(Menus!$A$2))=FALSE,0,IF(EXACT(UPPER($G$4),UPPER(Menus!$A$196)),IF(AND(EXACT(UPPER($I$16),UPPER(Menus!$A$2)),ISNUMBER($I$17)=FALSE),\"Valider I17\",IF(AND(EXACT(UPPER($I$25),UPPER(Menus!$A$2)),EXACT(UPPER($I$26),UPPER(Menus!$A$2))),Menus!$D$159*VLOOKUP($I$10,Tableau_ZT_Facteur,2,FALSE)*Facteur_Aide,IF(AND(OR(EXACT(UPPER($I$25),UPPER(Menus!$A$3)),EXACT(UPPER($I$25),UPPER(Sans_objet))),EXACT(UPPER($I$26),UPPER(Menus!$A$2))),Menus!$D$160*VLOOKUP($I$10,Tableau_ZT_Facteur,2,FALSE)*Facteur_Aide,IF(AND(EXACT(UPPER($I$25),UPPER(Menus!$A$2)),OR(EXACT(UPPER($I$26),UPPER(Menus!$A$3)),EXACT(UPPER($I$26),UPPER(Sans_objet)))),Menus!$D$161*VLOOKUP($I$10,Tableau_ZT_Facteur,2,FALSE)*Facteur_Aide,IF(AND(OR(EXACT(UPPER($I$25),UPPER(Menus!$A$3)),EXACT(UPPER($I$25),UPPER(Sans_objet))),OR(EXACT(UPPER($I$26),UPPER(Menus!$A$3)),EXACT(UPPER($I$26),UPPER(Sans_objet)))),Menus!$D$162*VLOOKUP($I$10,Tableau_ZT_Facteur,2,FALSE)*Facteur_Aide,0))))),0)),0)","v":0},null,null,null,null,null,null,null,null,null,null,null,null,null,null,null,null,null,null,null,null,null,null,null,null,null,null,null,null,null,null,null,null,null,null,null,null,null,null,null,null,null,null,null,null,null,null,null,null,null,null,null,null,null,null,null,null,null,null,null,null,null,null,null,null,null,null,null,null,null,null,null,null,null,null,null,null,null,null,null,null,null,null,null,null,null,null,null,null,"07151",258,280]
{"$rows_left_out":104}
{"sheet":"Carte - Admissibilité - Caribou","index":2,"n_rows":0,"n_cols":0,"rows_kept":0,"cut":false,"hidden":true,"merged":[]}

{"sheet":"Versions du fichier","index":3,"n_rows":10,"n_cols":33,"rows_kept":10,"cut":false,"hidden":true,"merged":[[0,0,0,16],[0,19,0,24]]}
["Programme d’investissement en aménagement forestier (PIAF) - Volet II\nForêt publique\nSuivi des versions du fichier de l'annexe au rapport et au calcul de l'aide pour la récolte des bois découlant de l’application des modalités\nd’aménagement de l’habitat du caribou forestier et montagnard pour l'exercice 2021-2022",null,null,null,null,null,null,null,null,null,null,null,null,null,null,null,null,null,null,"Version 2 : 2021-06-09",null,null,null,null,null,null,null,null,null,null,null,null,{"$f":"TODAY()","v":"2021-06-09"}]
[]
["Version 1","Nom du fichier :","Calcul_aide_PIAF_Volet_II_ Caribou_2021-2022_2021-04-08.xlsm"]
[{"$f":"A3","v":"Version 1"},"Date de mise en ligne :","2021-04-08 ou dans les jours suivants."]
[{"$f":"A4","v":"Version 1"},"Remarques :","• Version initiale proposée pour la période de consultation"]
[{"$f":"A5","v":"Version 1"}]
["Version 2","Nom du fichier :","Calcul_aide_PIAF_Volet_II_ Caribou_2021-2022_2021-06-09.xlsm"]
[{"$f":"A7","v":"Version 2"},"Date de mise en ligne :","2021-06-09 ou dans les jours suivants."]
[{"$f":"A8","v":"Version 2"},"Remarques :","• Version officielle"]
[{"$f":"A9","v":"Version 2"}]

{"sheet":"Menus","index":4,"n_rows":301,"n_cols":4,"rows_kept":301,"cut":false,"hidden":true,"merged":[]}
["Question (pondération via RechercheV du bloc Question)"]
["Oui",1]
["Non",0]
["Non admissible"]
["Sans objet"]
[]
["Tableau_ZT_Facteur"]
["ZT","Facteur ARRONDI3 (Calcul)","Facteur brut (Référence)"]
[154,{"$f":"ROUND(C9,3)","v":0.57099999999999995},0.57133685416779278]
[155,{"$f":"ROUND(C10,3)","v":0.52400000000000002},0.52409915791409578]
[156,0.57599999999999996,0.57593778687471053]
[157,0.49299999999999999,0.49280643096564364]
[158,0.434,0.43395320151047301]
[180,0.67900000000000005,0.67946073789245343]
[181,0.85299999999999998,0.85346670445166795]
[182,0.47399999999999998,0.47397054525637716]
[183,0.74399999999999999,0.74354471828335778]
[184,0.93100000000000005,0.93053413900980853]
[185,0.84299999999999997,0.84254802756042602]
[186,0.81699999999999995,0.8167974639720994]
[187,0.999,0.99890499900303786]
[193,1.0349999999999999,1.0349999999999999]
[194,0.90700000000000003,0.90700000000000003]
[195,0.77400000000000002,0.77400000000000002]
[200,1.081,1.0806904780151347]
[240,0.69599999999999995,0.69599999999999995]
[241,0.80300000000000005,0.80289800325202865]
[242,0.79100000000000004,0.79057799414527485]
[243,0.88600000000000001,0.88582382667728943]
[244,0.90100000000000002,0.90137094784480754]
{"$rows_left_out":272}
{"sheet":"Log","index":5,"n_rows":2,"n_cols":4,"rows_kept":2,"cut":false,"hidden":true,"merged":[]}
["Utilisateur","Date","OS","Excel"]
["Pouliot, Simon (BMMB)","2021-06-09T11:04:08","Windows (32-bit) NT 6.01","15.0"]